Target
NUAK family SNF1-like kinase 1
Ligand
BDBM50587670
Substrate
Meas. Tech.
ChEMBL_2184482 (CHEMBL5096564)
IC50
17±n/a nM
Citation
 Faisal, MKim, JHYoo, KHRoh, EJHong, SSLee, SH Development and Therapeutic Potential of NUAKs Inhibitors. J Med Chem 64:2-25 (2021) Target
Name:
NUAK family SNF1-like kinase 1
Synonyms:
ARK5 NUAK1 OMPHK1
Type:
PROTEIN
Mol. Mass.:
74326.51
Organism:
Homo sapiens (Human)
Description:
ChEMBL_1451343
Residue:
661
  
Inhibitor
Name:
BDBM50587670
Synonyms:
CHEMBL5202161
Type:
Small organic molecule
Emp. Form.:
C22H26N8O
Mol. Mass.:
418.4948
SMILES:
CN1c2ccccc2C(=O)N(C)c2c(C)nc(Nc3cnn(c3)C3CCNCC3)nc12
: