Target
NUAK family SNF1-like kinase 1
Ligand
BDBM50587674
Substrate
Meas. Tech.
ChEMBL_2184482 (CHEMBL5096564)
IC50
33±n/a nM
Citation
 Faisal, MKim, JHYoo, KHRoh, EJHong, SSLee, SH Development and Therapeutic Potential of NUAKs Inhibitors. J Med Chem 64:2-25 (2021) Target
Name:
NUAK family SNF1-like kinase 1
Synonyms:
ARK5 NUAK1 OMPHK1
Type:
PROTEIN
Mol. Mass.:
74326.51
Organism:
Homo sapiens (Human)
Description:
ChEMBL_1451343
Residue:
661
  
Inhibitor
Name:
BDBM50587674
Synonyms:
CHEMBL1643963
Type:
Small organic molecule
Emp. Form.:
C25H26N8O2
Mol. Mass.:
470.5263
SMILES:
CN1CCN(CC1)c1ccc(Nc2nc(Oc3cccc(NC(=O)C=C)c3)c3nc[nH]c3n2)cc1
: