Target
NUAK family SNF1-like kinase 1
Ligand
BDBM50587675
Substrate
Meas. Tech.
ChEMBL_2184482 (CHEMBL5096564)
IC50
1.5±n/a nM
Citation
 Faisal, MKim, JHYoo, KHRoh, EJHong, SSLee, SH Development and Therapeutic Potential of NUAKs Inhibitors. J Med Chem 64:2-25 (2021) Target
Name:
NUAK family SNF1-like kinase 1
Synonyms:
ARK5 NUAK1 OMPHK1
Type:
PROTEIN
Mol. Mass.:
74326.51
Organism:
Homo sapiens (Human)
Description:
ChEMBL_1451343
Residue:
661
  
Inhibitor
Name:
BDBM50587675
Synonyms:
CHEMBL4303523
Type:
Small organic molecule
Emp. Form.:
C25H29ClN6O3
Mol. Mass.:
496.989
SMILES:
CCC(=O)Nc1cccc(Oc2nc(Nc3ccc(cc3OC)N3CCN(C)CC3)ncc2Cl)c1
: