Target
NUAK family SNF1-like kinase 1
Ligand
BDBM50587679
Substrate
Meas. Tech.
ChEMBL_2184485 (CHEMBL5096567)
IC50
3.0±n/a nM
Citation
 Faisal, MKim, JHYoo, KHRoh, EJHong, SSLee, SH Development and Therapeutic Potential of NUAKs Inhibitors. J Med Chem 64:2-25 (2021) Target
Name:
NUAK family SNF1-like kinase 1
Synonyms:
ARK5 NUAK1 OMPHK1
Type:
PROTEIN
Mol. Mass.:
74326.51
Organism:
Homo sapiens (Human)
Description:
ChEMBL_1451343
Residue:
661
  
Inhibitor
Name:
BDBM50587679
Synonyms:
CHEMBL5199998
Type:
Small organic molecule
Emp. Form.:
C18H19N3O4S
Mol. Mass.:
373.426
SMILES:
CC1(C)C(=O)N([C@H]2CCc3c2cccc3O)c2nc(ncc12)S(C)(=O)=O
: