Target
NUAK family SNF1-like kinase 1
Ligand
BDBM50587681
Substrate
Meas. Tech.
ChEMBL_2184485 (CHEMBL5096567)
IC50
1.4±n/a nM
Citation
 Faisal, MKim, JHYoo, KHRoh, EJHong, SSLee, SH Development and Therapeutic Potential of NUAKs Inhibitors. J Med Chem 64:2-25 (2021) Target
Name:
NUAK family SNF1-like kinase 1
Synonyms:
ARK5 NUAK1 OMPHK1
Type:
PROTEIN
Mol. Mass.:
74326.51
Organism:
Homo sapiens (Human)
Description:
ChEMBL_1451343
Residue:
661
  
Inhibitor
Name:
BDBM50587681
Synonyms:
CHEMBL5176650
Type:
Small organic molecule
Emp. Form.:
C20H21N3O2
Mol. Mass.:
335.3996
SMILES:
CN(C)CCOc1ccc2c3c(ccc2c1)[nH]c1c(C)c[nH]c(=O)c31
: