Target
NUAK family SNF1-like kinase 1
Ligand
BDBM50587683
Substrate
Meas. Tech.
ChEMBL_2184485 (CHEMBL5096567)
IC50
4.8±n/a nM
Citation
 Faisal, MKim, JHYoo, KHRoh, EJHong, SSLee, SH Development and Therapeutic Potential of NUAKs Inhibitors. J Med Chem 64:2-25 (2021) Target
Name:
NUAK family SNF1-like kinase 1
Synonyms:
ARK5 NUAK1 OMPHK1
Type:
PROTEIN
Mol. Mass.:
74326.51
Organism:
Homo sapiens (Human)
Description:
ChEMBL_1451343
Residue:
661
  
Inhibitor
Name:
BDBM50587683
Synonyms:
CHEMBL5196626
Type:
Small organic molecule
Emp. Form.:
C23H25N3O2
Mol. Mass.:
375.4635
SMILES:
Cc1c[nH]c(=O)c2c1[nH]c1ccc3cc(OCCN4CCCCC4)ccc3c21
: