Target
Acetylcholinesterase
Ligand
BDBM50157912
Substrate
Meas. Tech.
ChEMBL_305184 (CHEMBL832772)
IC50
230±n/a nM
Citation
 Yoo, IDCho, KMLee, CKKim, WG Isoterreulactone A, a novel meroterpenoid with anti-acetylcholinesterase activity produced by Aspergillus terreus. Bioorg Med Chem Lett 15:353-6 (2004)  
Target
Name:
Acetylcholinesterase
Synonyms:
ACES_HUMAN Acetylcholinesterase (AChE) | Acetylcholinesterase (human AChE)
Type:
Enzyme
Mol. Mass.:
67792.70
Organism:
Homo sapiens (Human)
Description:
P22303
Residue:
614
  
Inhibitor
Name:
BDBM50157912
Synonyms:
13-hydroxy-16-methoxy-8-(4-methoxyphenyl)-4,14,19,19-tetramethyl-5,9,18-trioxapentacyclo[14.2.1.01,14.04,13.06,11]nonadeca-6(11),7-diene-10,15,17-trione | CHEMBL183507
Type:
Small organic molecule
Emp. Form.:
C28H30O9
Mol. Mass.:
510.5324
SMILES:
COc1ccc(cc1)-c1cc2O[C@]3(C)CC[C@]45OC(=O)[C@](OC)(C(=O)[C@]4(C)[C@]3(O)Cc2c(=O)o1)C5(C)C
: