Target
Acetylcholinesterase
Ligand
BDBM50157913
Substrate
Meas. Tech.
ChEMBL_305184 (CHEMBL832772)
IC50
420±n/a nM
Citation
 Yoo, IDCho, KMLee, CKKim, WG Isoterreulactone A, a novel meroterpenoid with anti-acetylcholinesterase activity produced by Aspergillus terreus. Bioorg Med Chem Lett 15:353-6 (2004)  
Target
Name:
Acetylcholinesterase
Synonyms:
ACES_HUMAN Acetylcholinesterase (AChE) | Acetylcholinesterase (human AChE)
Type:
Enzyme
Mol. Mass.:
67792.70
Organism:
Homo sapiens (Human)
Description:
P22303
Residue:
614
  
Inhibitor
Name:
BDBM50157913
Synonyms:
4a,12a-dihydroxy-3-methoxy-4,4,6a,12b-tetramethyl-9-(3,4,5-trimethoxyphenyl)-1,4a,5,6,6a,12,12a,12b-octahydro-4H,11H-benzo[f]pyrano[4,3-b]chromene-1,11-dione | CHEMBL367571
Type:
Small organic molecule
Emp. Form.:
C30H36O10
Mol. Mass.:
556.6008
SMILES:
COC1=CC(=O)[C@@]2(C)[C@](O)(CC[C@@]3(C)Oc4cc(oc(=O)c4C[C@@]23O)-c2cc(OC)c(OC)c(OC)c2)C1(C)C
: