Target
Cholinesterase
Ligand
BDBM50157914
Substrate
Meas. Tech.
ChEMBL_305212 (CHEMBL832465)
IC50
>200000±n/a nM
Citation
 Yoo, IDCho, KMLee, CKKim, WG Isoterreulactone A, a novel meroterpenoid with anti-acetylcholinesterase activity produced by Aspergillus terreus. Bioorg Med Chem Lett 15:353-6 (2004)  
Target
Name:
Cholinesterase
Synonyms:
Acylcholine acylhydrolase Butyrylcholine esterase (BChE) Butyrylcholinesterase (BuChE) CHLE_HUMAN Cholinesterases Pseudocholinesterase
Type:
Homotetramer
Mol. Mass.:
68422.27
Organism:
Homo sapiens (Human)
Description:
P06276
Residue:
602
  
Inhibitor
Name:
BDBM50157914
Synonyms:
4a,12a-dihydroxy-9-(4-methoxyphenyl)-4,4,6a,12b-tetramethyl-1,3,4,4a,5,6,6a,12,12a,12b-decahydro-2H,11H-benzo[f]pyrano[4,3-b]chromene-3,11-dione | CHEMBL183813
Type:
Small organic molecule
Emp. Form.:
C27H32O7
Mol. Mass.:
468.5388
SMILES:
COc1ccc(cc1)-c1cc2O[C@]3(C)CC[C@]4(O)C(C)(C)C(=O)CC[C@]4(C)[C@]3(O)Cc2c(=O)o1
: