Target
Acetylcholinesterase
Ligand
BDBM50157915
Substrate
Meas. Tech.
ChEMBL_305184 (CHEMBL832772)
IC50
90±n/a nM
Citation
 Yoo, IDCho, KMLee, CKKim, WG Isoterreulactone A, a novel meroterpenoid with anti-acetylcholinesterase activity produced by Aspergillus terreus. Bioorg Med Chem Lett 15:353-6 (2004)  
Target
Name:
Acetylcholinesterase
Synonyms:
ACES_HUMAN Acetylcholinesterase (AChE) | Acetylcholinesterase (human AChE)
Type:
Enzyme
Mol. Mass.:
67792.70
Organism:
Homo sapiens (Human)
Description:
P22303
Residue:
614
  
Inhibitor
Name:
BDBM50157915
Synonyms:
4a,12a-dihydroxy-9-(4-methoxyphenyl)-4,4,6a,12b-tetramethyl-3,4a,5,6,6a,12,12a,12b-octahydro-4H,11H-benzo[f]pyrano[4,3-b]chromene-3,11-dione | CHEMBL424984
Type:
Small organic molecule
Emp. Form.:
C27H30O7
Mol. Mass.:
466.5229
SMILES:
COc1ccc(cc1)-c1cc2O[C@]3(C)CC[C@]4(O)C(C)(C)C(=O)C=C[C@]4(C)[C@]3(O)Cc2c(=O)o1
: