Target
Cholinesterase
Ligand
BDBM50157912
Substrate
Meas. Tech.
ChEMBL_305212 (CHEMBL832465)
IC50
>200000±n/a nM
Citation
 Yoo, IDCho, KMLee, CKKim, WG Isoterreulactone A, a novel meroterpenoid with anti-acetylcholinesterase activity produced by Aspergillus terreus. Bioorg Med Chem Lett 15:353-6 (2004)  
Target
Name:
Cholinesterase
Synonyms:
Acylcholine acylhydrolase Butyrylcholine esterase (BChE) Butyrylcholinesterase (BuChE) CHLE_HUMAN Cholinesterases Pseudocholinesterase
Type:
Homotetramer
Mol. Mass.:
68422.27
Organism:
Homo sapiens (Human)
Description:
P06276
Residue:
602
  
Inhibitor
Name:
BDBM50157912
Synonyms:
13-hydroxy-16-methoxy-8-(4-methoxyphenyl)-4,14,19,19-tetramethyl-5,9,18-trioxapentacyclo[14.2.1.01,14.04,13.06,11]nonadeca-6(11),7-diene-10,15,17-trione | CHEMBL183507
Type:
Small organic molecule
Emp. Form.:
C28H30O9
Mol. Mass.:
510.5324
SMILES:
COc1ccc(cc1)-c1cc2O[C@]3(C)CC[C@]45OC(=O)[C@](OC)(C(=O)[C@]4(C)[C@]3(O)Cc2c(=O)o1)C5(C)C
: