Target
Lysine-specific histone demethylase 1A
Ligand
BDBM50226664
Substrate
Meas. Tech.
ChEMBL_2184891 (CHEMBL5096973)
IC50
470±n/a nM
Citation
 Fu, DJLi, JYu, B Annual review of LSD1/KDM1A inhibitors in 2020. Eur J Med Chem 214:0 (2021) Target
Name:
Lysine-specific histone demethylase 1A
Synonyms:
AOF2 Flavin-containing amine oxidase domain-containing protein 2 KDM1A KIAA0601 Lysine-specific demethylase 1 (LSD1) Lysine-specific histone demethylase 1 (LSD1)
Type:
Enzyme
Mol. Mass.:
92901.01
Organism:
Homo sapiens (Human)
Description:
O60341
Residue:
852
  
Inhibitor
Name:
BDBM50226664
Synonyms:
2-hydroxy-3,9,10-trimethoxy-5,6-dihydroisoquino[3,2-a]isoquinolinium columbamine
Type:
Small organic molecule
Emp. Form.:
C20H20NO4
Mol. Mass.:
338.3766
SMILES:
COc1cc2CC[n+]3cc4c(OC)c(OC)ccc4cc3-c2cc1O
: