Target
Cytochrome c oxidase subunit 2
Ligand
BDBM50587915
Substrate
Meas. Tech.
ChEMBL_2185778 (CHEMBL5097860)
IC50
170±n/a nM
Citation
 Neha, KWakode, S Contemporary advances of cyclic molecules proposed for inflammation. Eur J Med Chem 221:0 (2021) Target
Name:
Cytochrome c oxidase subunit 2
Synonyms:
COII COX2_SHEEP Cytochrome c oxidase polypeptide II MTCO2
Type:
PROTEIN
Mol. Mass.:
25987.16
Organism:
Ovis aries
Description:
ChEMBL_662815
Residue:
227
  
Inhibitor
Name:
BDBM50587915
Synonyms:
CHEMBL5196989
Type:
Small organic molecule
Emp. Form.:
C25H19NO5
Mol. Mass.:
413.4221
SMILES:
COc1ccc(\C=C\C(=O)c2cccc(c2)N2C(=O)c3ccccc3C2=O)cc1OC
: