Target
Cytochrome c oxidase subunit 2
Ligand
BDBM50587916
Substrate
Meas. Tech.
ChEMBL_2185785 (CHEMBL5097867)
IC50
1200±n/a nM
Citation
 Neha, KWakode, S Contemporary advances of cyclic molecules proposed for inflammation. Eur J Med Chem 221:0 (2021) Target
Name:
Cytochrome c oxidase subunit 2
Synonyms:
COII COX2_SHEEP Cytochrome c oxidase polypeptide II MTCO2
Type:
PROTEIN
Mol. Mass.:
25987.16
Organism:
Ovis aries
Description:
ChEMBL_662815
Residue:
227
  
Inhibitor
Name:
BDBM50587916
Synonyms:
CHEMBL5198027
Type:
Small organic molecule
Emp. Form.:
C26H21FO2S2
Mol. Mass.:
448.572
SMILES:
C[S+]([O-])c1ccc(\C=C2\C(C)=C(CC(=O)Sc3ccccc3)c3cc(F)ccc23)cc1
: