Target
Potassium voltage-gated channel subfamily H member 2
Ligand
BDBM384192
Substrate
Meas. Tech.
ChEMBL_2186534 (CHEMBL5098616)
IC50
3500±n/a nM
Target
Name:
Potassium voltage-gated channel subfamily H member 2
Synonyms:
1,3-beta-glucan synthase component GLS2 ERG Eag-related protein 1 Ether-a-go-go-related gene (HERG) Ether-a-go-go-related gene potassium channel 1 Ether-a-go-go-related gene potassium channel 1 (hERG1) Ether-a-go-go-related protein 1 H-ERG KCNH2 Potassium voltage-gated channel subfamily H member 2 (hERG) Voltage-gated potassium channel subunit Kv11.1 hERG Potassium Channel 1 | putative potassium channel subunit
Type:
Multi-pass membrane protein
Mol. Mass.:
126672.65
Organism:
Homo sapiens (Human)
Description:
Q12809
Residue:
1159
  
Inhibitor
Name:
BDBM384192
Synonyms:
4-(6-(4-Amino-4-methylpiperidin-1-yl)-1H-pyrazolo[3,4-b]pyrazin-3-yl)-3-chloro-N-methylpyridin-2-amine US10851110, Example 112 | US11466017, Example 112
Type:
Small organic molecule
Emp. Form.:
C17H21ClN8
Mol. Mass.:
372.855
SMILES:
CNc1nccc(-c2n[nH]c3nc(cnc23)N2CCC(C)(N)CC2)c1Cl
: