Target
Alpha-1A adrenergic receptor
Ligand
BDBM50143673
Substrate
Meas. Tech.
ChEMBL_303343 (CHEMBL840159)
Ki
42±n/a nM
Citation
 Li, MYTsai, KCXia, L Pharmacophore identification of alpha(1A)-adrenoceptor antagonists. Bioorg Med Chem Lett 15:657-64 (2005)  
Target
Name:
Alpha-1A adrenergic receptor
Synonyms:
ADA1A_HUMAN ADRA1C Alpha 1A-adrenoceptor Alpha adrenergic receptor 1a Alpha-adrenergic receptor 1c adrenergic Alpha1 | adrenergic Alpha1C
Type:
Cell-surface receptors
Mol. Mass.:
51511.67
Organism:
Homo sapiens (Human)
Description:
P35348
Residue:
466
  
Inhibitor
Name:
BDBM50143673
Synonyms:
8-{2-[4-(2,5-Dichloro-phenyl)-piperazin-1-yl]-ethyl}-8-aza-spiro[4.5]decan-7-one | CHEMBL301224
Type:
Small organic molecule
Emp. Form.:
C21H29Cl2N3O
Mol. Mass.:
410.38
SMILES:
Clc1ccc(Cl)c(c1)N1CCN(CCN2CCC3(CCCC3)CC2=O)CC1
: