Target
Dual specificity tyrosine-phosphorylation-regulated kinase 1B
Ligand
BDBM293424
Substrate
Meas. Tech.
ChEMBL_2193638 (CHEMBL5105998)
IC50
2.0±n/a nM
Citation
 Blackie, ACFoley, DJ Exploring the roles of the Cdc2-like kinases in cancers. Bioorg Med Chem 70:0 (2022) Target
Name:
Dual specificity tyrosine-phosphorylation-regulated kinase 1B
Synonyms:
DYR1B_HUMAN Dual specificity tyrosine-phosphorylation-regulated kinase 1B MIRK
Type:
Enzyme
Mol. Mass.:
69222.24
Organism:
Homo sapiens (Human)
Description:
Q9Y463
Residue:
629
  
Inhibitor
Name:
BDBM293424
Synonyms:
US10106527, Compound 10 US10106527, Compound 143 US10106527, Compound 459 US11548872, Compound 459 US9951048, Compound 459
Type:
Small organic molecule
Emp. Form.:
C24H25N7O
Mol. Mass.:
427.5016
SMILES:
CN1CCN(CC1)c1cc(ccn1)C(=O)Nc1cc2cc(ccc2cn1)-c1cnn(C)c1
: