Target
Dual specificity tyrosine-phosphorylation-regulated kinase 2
Ligand
BDBM293424
Substrate
Meas. Tech.
ChEMBL_2193639 (CHEMBL5105999)
IC50
2.0±n/a nM
Citation
 Blackie, ACFoley, DJ Exploring the roles of the Cdc2-like kinases in cancers. Bioorg Med Chem 70:0 (2022) Target
Name:
Dual specificity tyrosine-phosphorylation-regulated kinase 2
Synonyms:
DYRK2 Dual-specificity tyrosine-phosphorylation regulated kinase 2
Type:
PROTEIN
Mol. Mass.:
66690.69
Organism:
Homo sapiens (Human)
Description:
ChEMBL_1508025
Residue:
601
  
Inhibitor
Name:
BDBM293424
Synonyms:
US10106527, Compound 10 US10106527, Compound 143 US10106527, Compound 459 US11548872, Compound 459 US9951048, Compound 459
Type:
Small organic molecule
Emp. Form.:
C24H25N7O
Mol. Mass.:
427.5016
SMILES:
CN1CCN(CC1)c1cc(ccn1)C(=O)Nc1cc2cc(ccc2cn1)-c1cnn(C)c1
: