Target
Caspase-3
Ligand
BDBM50160961
Substrate
Meas. Tech.
ChEMBL_305651 (CHEMBL829509)
IC50
0.005000±n/a nM
Citation
 Han, YGiroux, AColucci, JBayly, CIMckay, DJRoy, SXanthoudakis, SVaillancourt, JRasper, DMTam, JTawa, PNicholson, DWZamboni, RJ Novel pyrazinone mono-amides as potent and reversible caspase-3 inhibitors. Bioorg Med Chem Lett 15:1173-80 (2005)  
Target
Name:
Caspase-3
Synonyms:
Apopain CASP3 CPP-32 Caspase 3 Caspase-3 subunit p17 SCA-1 Yama protein | caspase-3 preproprotein
Type:
Hydrolase; heterotetramer of two heterodimers
Mol. Mass.:
31607.55
Organism:
Homo sapiens (Human)
Description:
Residue:
277
  
Inhibitor
Name:
BDBM50160961
Synonyms:
(S)-5-Benzylsulfanyl-3-{(S)-2-[2-(5-methanesulfonyl-2-methoxy-phenyl)-acetylamino]-3-methyl-butyrylamino}-4-oxo-pentanoic acid | CHEMBL425699
Type:
Small organic molecule
Emp. Form.:
C27H34N2O8S2
Mol. Mass.:
578.697
SMILES:
COc1ccc(cc1CC(=O)N[C@@H](C(C)C)C(=O)N[C@@H](CC(O)=O)C(=O)CSCc1ccccc1)S(C)(=O)=O
: