Target
Caspase-3
Ligand
BDBM50160960
Substrate
Meas. Tech.
ChEMBL_305651 (CHEMBL829509)
IC50
0.000300±n/a nM
Citation
 Han, YGiroux, AColucci, JBayly, CIMckay, DJRoy, SXanthoudakis, SVaillancourt, JRasper, DMTam, JTawa, PNicholson, DWZamboni, RJ Novel pyrazinone mono-amides as potent and reversible caspase-3 inhibitors. Bioorg Med Chem Lett 15:1173-80 (2005)  
Target
Name:
Caspase-3
Synonyms:
Apopain CASP3 CPP-32 Caspase 3 Caspase-3 subunit p17 SCA-1 Yama protein | caspase-3 preproprotein
Type:
Hydrolase; heterotetramer of two heterodimers
Mol. Mass.:
31607.55
Organism:
Homo sapiens (Human)
Description:
Residue:
277
  
Inhibitor
Name:
BDBM50160960
Synonyms:
(S)-3-{(S)-2-[3-((S)-2-Acetylamino-3-carboxy-propionylamino)-2-oxo-2H-pyridin-1-yl]-butyrylamino}-5-benzylsulfanyl-4-oxo-pentanoic acid | CHEMBL178116
Type:
Small organic molecule
Emp. Form.:
C27H32N4O9S
Mol. Mass.:
588.629
SMILES:
CC[C@@H](C(=O)N[C@@H](CC(O)=O)C(=O)CSCc1ccccc1)n1cccc(NC(=O)[C@H](CC(O)=O)NC(C)=O)c1=O
: