Target
Caspase-3
Ligand
BDBM10652
Substrate
Meas. Tech.
ChEMBL_305651 (CHEMBL829509)
IC50
0.000800±n/a nM
Citation
 Han, YGiroux, AColucci, JBayly, CIMckay, DJRoy, SXanthoudakis, SVaillancourt, JRasper, DMTam, JTawa, PNicholson, DWZamboni, RJ Novel pyrazinone mono-amides as potent and reversible caspase-3 inhibitors. Bioorg Med Chem Lett 15:1173-80 (2005)  
Target
Name:
Caspase-3
Synonyms:
Apopain CASP3 CPP-32 Caspase 3 Caspase-3 subunit p17 SCA-1 Yama protein | caspase-3 preproprotein
Type:
Hydrolase; heterotetramer of two heterodimers
Mol. Mass.:
31607.55
Organism:
Homo sapiens (Human)
Description:
Residue:
277
  
Inhibitor
Name:
BDBM10652
Synonyms:
(3S)-3-[(2S)-2-[(4S)-4-[(3S)-3-acetamido-3-formamidopropanoic acid]-4-formamidobutanoic acid]-3-methylbutanamido]-4-oxo-7-phenylheptanoic acid Compound 2 | PHENYL-PROPYL-KETONE INHIBITOR
Type:
Small organic molecule
Emp. Form.:
C29H40N4O11
Mol. Mass.:
620.6481
SMILES:
CC(C)[C@H](NC(=O)[C@H](CCC(O)=O)NC(=O)[C@H](CC(O)=O)NC(C)=O)C(=O)N[C@@H](CC(O)=O)C(=O)CCCc1ccccc1
: