Target
Caspase-3
Ligand
BDBM50160985
Substrate
Meas. Tech.
ChEMBL_305651 (CHEMBL829509)
IC50
0.023000±n/a nM
Citation
 Han, YGiroux, AColucci, JBayly, CIMckay, DJRoy, SXanthoudakis, SVaillancourt, JRasper, DMTam, JTawa, PNicholson, DWZamboni, RJ Novel pyrazinone mono-amides as potent and reversible caspase-3 inhibitors. Bioorg Med Chem Lett 15:1173-80 (2005)  
Target
Name:
Caspase-3
Synonyms:
Apopain CASP3 CPP-32 Caspase 3 Caspase-3 subunit p17 SCA-1 Yama protein | caspase-3 preproprotein
Type:
Hydrolase; heterotetramer of two heterodimers
Mol. Mass.:
31607.55
Organism:
Homo sapiens (Human)
Description:
Residue:
277
  
Inhibitor
Name:
BDBM50160985
Synonyms:
(S)-5-[(7-Aza-bicyclo[2.2.1]hept-7-ylmethyl)-amino]-3-(2-{3-[(4-methyl-furazan-3-ylmethyl)-amino]-2-oxo-2H-pyrazin-1-yl}-butyrylamino)-4-oxo-pentanoic acid | CHEMBL178674
Type:
Small organic molecule
Emp. Form.:
C24H34N8O6
Mol. Mass.:
530.5768
SMILES:
CCC(C(=O)N[C@@H](CC(O)=O)C(=O)CNCN1C2CCC1CC2)n1ccnc(NCc2nonc2C)c1=O
: