Target
Caspase-3
Ligand
BDBM50160968
Substrate
Meas. Tech.
ChEMBL_305651 (CHEMBL829509)
IC50
0.080000±n/a nM
Citation
 Han, YGiroux, AColucci, JBayly, CIMckay, DJRoy, SXanthoudakis, SVaillancourt, JRasper, DMTam, JTawa, PNicholson, DWZamboni, RJ Novel pyrazinone mono-amides as potent and reversible caspase-3 inhibitors. Bioorg Med Chem Lett 15:1173-80 (2005)  
Target
Name:
Caspase-3
Synonyms:
Apopain CASP3 CPP-32 Caspase 3 Caspase-3 subunit p17 SCA-1 Yama protein | caspase-3 preproprotein
Type:
Hydrolase; heterotetramer of two heterodimers
Mol. Mass.:
31607.55
Organism:
Homo sapiens (Human)
Description:
Residue:
277
  
Inhibitor
Name:
BDBM50160968
Synonyms:
(S)-5-Benzylsulfanyl-3-(2-{3-[2-(3-methyl-[1,2,4]oxadiazol-5-yl)-ethylamino]-2-oxo-2H-pyrazin-1-yl}-butyrylamino)-4-oxo-pentanoic acid | CHEMBL360915
Type:
Small organic molecule
Emp. Form.:
C25H30N6O6S
Mol. Mass.:
542.607
SMILES:
CCC(C(=O)N[C@@H](CC(O)=O)C(=O)CSCc1ccccc1)n1ccnc(NCCc2nc(C)no2)c1=O
: