Target
Glycogen synthase kinase 3
Ligand
BDBM50259155
Substrate
Meas. Tech.
ChEMBL_2194682 (CHEMBL5107042)
IC50
23±n/a nM
Citation
 Galal, KATruong, AKwarcinski, Fde Silva, CAvalani, KHavener, TMChirgwin, MEMerten, EOng, HWWillis, CAbdelwaly, AHelal, MADerbyshire, ERZutshi, RDrewry, DH Identification of Novel 2,4,5-Trisubstituted Pyrimidines as Potent Dual Inhibitors of Plasmodial  J Med Chem 65:13172-13197 (2022)  
Target
Name:
Glycogen synthase kinase 3
Synonyms:
Type:
PROTEIN
Mol. Mass.:
51607.56
Organism:
Plasmodium falciparum (isolate 3D7)
Description:
ChEMBL_749959
Residue:
440
  
Inhibitor
Name:
BDBM50259155
Synonyms:
(Z)-Hymenialdisine | Hymenialdisine
Type:
Small organic molecule
Emp. Form.:
C11H10BrN5O2
Mol. Mass.:
324.133
SMILES:
NC1=NC(=O)\C(N1)=C1/CCNC(=O)c2[nH]c(Br)cc12
: