Target
Glycogen synthase kinase 3
Ligand
BDBM50424223
Substrate
Meas. Tech.
ChEMBL_2194682 (CHEMBL5107042)
IC50
480±n/a nM
Citation
 Galal, KATruong, AKwarcinski, Fde Silva, CAvalani, KHavener, TMChirgwin, MEMerten, EOng, HWWillis, CAbdelwaly, AHelal, MADerbyshire, ERZutshi, RDrewry, DH Identification of Novel 2,4,5-Trisubstituted Pyrimidines as Potent Dual Inhibitors of Plasmodial  J Med Chem 65:13172-13197 (2022)  
Target
Name:
Glycogen synthase kinase 3
Synonyms:
Type:
PROTEIN
Mol. Mass.:
51607.56
Organism:
Plasmodium falciparum (isolate 3D7)
Description:
ChEMBL_749959
Residue:
440
  
Inhibitor
Name:
BDBM50424223
Synonyms:
CHEMBL2313853
Type:
Small organic molecule
Emp. Form.:
C21H12Cl2N4OS
Mol. Mass.:
439.317
SMILES:
Nc1c(sc2nc(N)c(C#N)c(-c3ccccc3Cl)c12)C(=O)c1cccc(Cl)c1
: