Target
Glycogen synthase kinase 3
Ligand
BDBM50589999
Substrate
Meas. Tech.
ChEMBL_2194682 (CHEMBL5107042)
IC50
810±n/a nM
Citation
 Galal, KATruong, AKwarcinski, Fde Silva, CAvalani, KHavener, TMChirgwin, MEMerten, EOng, HWWillis, CAbdelwaly, AHelal, MADerbyshire, ERZutshi, RDrewry, DH Identification of Novel 2,4,5-Trisubstituted Pyrimidines as Potent Dual Inhibitors of Plasmodial  J Med Chem 65:13172-13197 (2022)  
Target
Name:
Glycogen synthase kinase 3
Synonyms:
Type:
PROTEIN
Mol. Mass.:
51607.56
Organism:
Plasmodium falciparum (isolate 3D7)
Description:
ChEMBL_749959
Residue:
440
  
Inhibitor
Name:
BDBM50589999
Synonyms:
CHEMBL5195159
Type:
Small organic molecule
Emp. Form.:
C24H23N5OS
Mol. Mass.:
429.537
SMILES:
CN1CCN(CC1)C(=O)c1ccc(Nc2nccc(n2)-c2cc3ccccc3s2)cc1
: