Target
Glycogen synthase kinase 3
Ligand
BDBM50590000
Substrate
Meas. Tech.
ChEMBL_2194682 (CHEMBL5107042)
IC50
308±n/a nM
Citation
 Galal, KATruong, AKwarcinski, Fde Silva, CAvalani, KHavener, TMChirgwin, MEMerten, EOng, HWWillis, CAbdelwaly, AHelal, MADerbyshire, ERZutshi, RDrewry, DH Identification of Novel 2,4,5-Trisubstituted Pyrimidines as Potent Dual Inhibitors of Plasmodial  J Med Chem 65:13172-13197 (2022)  
Target
Name:
Glycogen synthase kinase 3
Synonyms:
Type:
PROTEIN
Mol. Mass.:
51607.56
Organism:
Plasmodium falciparum (isolate 3D7)
Description:
ChEMBL_749959
Residue:
440
  
Inhibitor
Name:
BDBM50590000
Synonyms:
CHEMBL5208765
Type:
Small organic molecule
Emp. Form.:
C25H25N5OS
Mol. Mass.:
443.564
SMILES:
CN1CCC(CC1)NC(=O)c1ccc(Nc2nccc(n2)-c2cc3ccccc3s2)cc1
: