Target
Glycogen synthase kinase 3
Ligand
BDBM50590001
Substrate
Meas. Tech.
ChEMBL_2194682 (CHEMBL5107042)
IC50
226±n/a nM
Citation
 Galal, KATruong, AKwarcinski, Fde Silva, CAvalani, KHavener, TMChirgwin, MEMerten, EOng, HWWillis, CAbdelwaly, AHelal, MADerbyshire, ERZutshi, RDrewry, DH Identification of Novel 2,4,5-Trisubstituted Pyrimidines as Potent Dual Inhibitors of Plasmodial  J Med Chem 65:13172-13197 (2022)  
Target
Name:
Glycogen synthase kinase 3
Synonyms:
Type:
PROTEIN
Mol. Mass.:
51607.56
Organism:
Plasmodium falciparum (isolate 3D7)
Description:
ChEMBL_749959
Residue:
440
  
Inhibitor
Name:
BDBM50590001
Synonyms:
CHEMBL5202515
Type:
Small organic molecule
Emp. Form.:
C27H30N6OS
Mol. Mass.:
486.632
SMILES:
CN1CCN(CCCNC(=O)c2ccc(Nc3nccc(n3)-c3cc4ccccc4s3)cc2)CC1
: