Target
Glycogen synthase kinase 3
Ligand
BDBM50590002
Substrate
Meas. Tech.
ChEMBL_2194682 (CHEMBL5107042)
IC50
243±n/a nM
Citation
 Galal, KATruong, AKwarcinski, Fde Silva, CAvalani, KHavener, TMChirgwin, MEMerten, EOng, HWWillis, CAbdelwaly, AHelal, MADerbyshire, ERZutshi, RDrewry, DH Identification of Novel 2,4,5-Trisubstituted Pyrimidines as Potent Dual Inhibitors of Plasmodial  J Med Chem 65:13172-13197 (2022)  
Target
Name:
Glycogen synthase kinase 3
Synonyms:
Type:
PROTEIN
Mol. Mass.:
51607.56
Organism:
Plasmodium falciparum (isolate 3D7)
Description:
ChEMBL_749959
Residue:
440
  
Inhibitor
Name:
BDBM50590002
Synonyms:
CHEMBL5179526
Type:
Small organic molecule
Emp. Form.:
C26H27N5O2S
Mol. Mass.:
473.59
SMILES:
O=C(NCCCN1CCOCC1)c1ccc(Nc2nccc(n2)-c2cc3ccccc3s2)cc1
: