Target
Glycogen synthase kinase 3
Ligand
BDBM50590004
Substrate
Meas. Tech.
ChEMBL_2194682 (CHEMBL5107042)
IC50
223±n/a nM
Citation
 Galal, KATruong, AKwarcinski, Fde Silva, CAvalani, KHavener, TMChirgwin, MEMerten, EOng, HWWillis, CAbdelwaly, AHelal, MADerbyshire, ERZutshi, RDrewry, DH Identification of Novel 2,4,5-Trisubstituted Pyrimidines as Potent Dual Inhibitors of Plasmodial  J Med Chem 65:13172-13197 (2022)  
Target
Name:
Glycogen synthase kinase 3
Synonyms:
Type:
PROTEIN
Mol. Mass.:
51607.56
Organism:
Plasmodium falciparum (isolate 3D7)
Description:
ChEMBL_749959
Residue:
440
  
Inhibitor
Name:
BDBM50590004
Synonyms:
CHEMBL5198648
Type:
Small organic molecule
Emp. Form.:
C23H22N4O3S2
Mol. Mass.:
466.576
SMILES:
CS(=O)(=O)CCCNC(=O)c1ccc(Nc2nccc(n2)-c2cc3ccccc3s2)cc1
: