Target
Glycogen synthase kinase 3
Ligand
BDBM50590011
Substrate
Meas. Tech.
ChEMBL_2194682 (CHEMBL5107042)
IC50
710±n/a nM
Citation
 Galal, KATruong, AKwarcinski, Fde Silva, CAvalani, KHavener, TMChirgwin, MEMerten, EOng, HWWillis, CAbdelwaly, AHelal, MADerbyshire, ERZutshi, RDrewry, DH Identification of Novel 2,4,5-Trisubstituted Pyrimidines as Potent Dual Inhibitors of Plasmodial  J Med Chem 65:13172-13197 (2022)  
Target
Name:
Glycogen synthase kinase 3
Synonyms:
Type:
PROTEIN
Mol. Mass.:
51607.56
Organism:
Plasmodium falciparum (isolate 3D7)
Description:
ChEMBL_749959
Residue:
440
  
Inhibitor
Name:
BDBM50590011
Synonyms:
CHEMBL5201703
Type:
Small organic molecule
Emp. Form.:
C29H31N5OS
Mol. Mass.:
497.654
SMILES:
Cc1cnc(Nc2ccc(cc2)C(=O)N2CCC(CC2)N2CCCC2)nc1-c1cc2ccccc2s1
: