Target
Protein mono-ADP-ribosyltransferase PARP4
Ligand
BDBM50590274
Substrate
Meas. Tech.
ChEMBL_2195788 (CHEMBL5108304)
IC50
800±n/a nM
Citation
 Kirby, ITPerson, ACohen, M Rational design of selective inhibitors of PARP4. RSC Med Chem 12:1950-1957 (2021) Target
Name:
Protein mono-ADP-ribosyltransferase PARP4
Synonyms:
(ARTD4 or PARP4) 2.4.2.- ADP-ribosyltransferase diphtheria toxin-like 4 ADPRTL1 KIAA0177 PARP-4 PARP4 PARPL Poly [ADP-ribose] polymerase 4 VPARP | Vault poly(ADP-ribose) polymerase
Type:
Mol. Mass.:
192563.23
Organism:
Homo sapiens (Human)
Description:
Q9UKK3
Residue:
1724
  
Inhibitor
Name:
BDBM50590274
Synonyms:
CHEMBL5200299
Type:
Small organic molecule
Emp. Form.:
C17H13IN2O3S
Mol. Mass.:
452.266
SMILES:
Cc1cc(I)cc2c1nc(CSc1ccc(cc1)C(O)=O)[nH]c2=O
: