Target
Lysine-specific histone demethylase 1A
Ligand
BDBM9461
Substrate
Meas. Tech.
ChEMBL_2196785 (CHEMBL5109301)
IC50
2950±n/a nM
Citation
 Dong, JPervaiz, WTayyab, BLi, DKang, LZhang, HGong, HMa, XLi, JAgboyibor, CBi, YLiu, H A comprehensive comparative study on LSD1 in different cancers and tumor specific LSD1 inhibitors. Eur J Med Chem 240:0 (2022) Target
Name:
Lysine-specific histone demethylase 1A
Synonyms:
AOF2 Flavin-containing amine oxidase domain-containing protein 2 KDM1A KIAA0601 Lysine-specific demethylase 1 (LSD1) Lysine-specific histone demethylase 1 (LSD1)
Type:
Enzyme
Mol. Mass.:
92901.01
Organism:
Homo sapiens (Human)
Description:
O60341
Residue:
852
  
Inhibitor
Name:
BDBM9461
Synonyms:
5,7-dihydroxy-3-(4-methoxyphenyl)-4H-chromen-4-one Biochanin A (BCA) CHEMBL131921 | cid_5280373
Type:
Small organic molecule
Emp. Form.:
C16H12O5
Mol. Mass.:
284.2635
SMILES:
COc1ccc(cc1)-c1coc2cc(O)cc(O)c2c1=O
: