Target
Estrogen receptor beta
Ligand
BDBM50106635
Substrate
Meas. Tech.
ChEMBL_2198164 (CHEMBL5110680)
EC50
0.660000±n/a nM
Citation
 Khan, MZIUzair, MNazli, AChen, JZ An overview on Estrogen receptors signaling and its ligands in breast cancer. Eur J Med Chem 241:0 (2022) Target
Name:
Estrogen receptor beta
Synonyms:
ER-beta ESR2_HUMAN Estradiol receptor beta (ERβ) Estrogen receptor (ER beta) Estrogen receptor beta (ER beta) NR3A2 estrogen beta
Type:
Protein
Mol. Mass.:
59238.43
Organism:
Homo sapiens (Human)
Description:
Q92731
Residue:
530
  
Inhibitor
Name:
BDBM50106635
Synonyms:
(+/-)-2,3-bis(4-hydroxyphenyl)propanenitrile 2,3-bis(4-hydroxyphenyl)propanenitrile DIARYLPROPIONITRILE
Type:
Small organic molecule
Emp. Form.:
C15H13NO2
Mol. Mass.:
239.2692
SMILES:
Oc1ccc(CC(C#N)c2ccc(O)cc2)cc1
: