Target
Galectin-4
Ligand
BDBM50591131
Substrate
Meas. Tech.
ChEMBL_2199424 (CHEMBL5111940)
Kd
3220±n/a nM
Citation
 Zetterberg, FRMacKinnon, ABrimert, TGravelle, LJohnsson, REKahl-Knutson, BLeffler, HNilsson, UJPedersen, APeterson, KRoper, JASchambye, HSlack, RJTantawi, S Discovery and Optimization of the First Highly Effective and Orally Available Galectin-3 Inhibitors for Treatment of Fibrotic Disease. J Med Chem 65:12626-12638 (2022) Target
Name:
Galectin-4
Synonyms:
Antigen NY-CO-27 L-36 lactose-binding protein LEG4_HUMAN Lactose-binding lectin 4
Type:
PROTEIN
Mol. Mass.:
35952.28
Organism:
Homo sapiens (Human)
Description:
ChEMBL_716454
Residue:
323
  
Inhibitor
Name:
BDBM50591131
Synonyms:
CHEMBL5193805
Type:
Small organic molecule
Emp. Form.:
C21H16ClF3N4O4S
Mol. Mass.:
512.889
SMILES:
OC[C@H]1O[C@H](Sc2ccc(C#N)c(Cl)c2)[C@H](O)[C@H]([C@H]1O)n1cc(nn1)-c1cc(F)c(F)c(F)c1
: