Target
Glutamate receptor ionotropic, NMDA 1/2A
Ligand
BDBM50164549
Substrate
Meas. Tech.
ChEMBL_303758 (CHEMBL829801)
Ki
320±n/a nM
Citation
 Morley, RMTse, HWFeng, BMiller, JCMonaghan, DTJane, DE Synthesis and pharmacology of N1-substituted piperazine-2,3-dicarboxylic acid derivatives acting as NMDA receptor antagonists. J Med Chem 48:2627-37 (2005)  
Target
Name:
Glutamate receptor ionotropic, NMDA 1/2A
Synonyms:
Glutamate NMDA receptor; Grin1/Grin2a | Glutamate [NMDA] receptor subunit epsilon 1/zeta 1
Type:
Mol. Mass.:
Description:
ASSAY_ID of EBI is 141020
Components:
This complex has 2 components.
Component 1
Name:
Glutamate receptor ionotropic, NMDA 2A
Synonyms:
Glutamate NMDA receptor; Grin1/Grin2a Grin2a NMDE1_RAT
Type:
Protein
Mol. Mass.:
165478.25
Organism:
Rattus norvegicus (Rat)
Description:
Q00959
Residue:
1464
  
Component 2
Name:
Glutamate receptor ionotropic, NMDA 1
Synonyms:
Glutamate (NMDA) receptor subunit zeta 1 Glutamate-NMDA-Channel Glutamate-NMDA-Polyamine NMDA Nmdar1 | phencyclidine
Type:
Enzyme Catalytic Domain
Mol. Mass.:
105533.40
Organism:
RAT
Description:
P35439
Residue:
938
  
Inhibitor
Name:
BDBM50164549
Synonyms:
(2R,3S)-1-(7-Bromo-phenanthrene-2-carbonyl)-piperazine-2,3-dicarboxylic acid | CHEMBL192866
Type:
Small organic molecule
Emp. Form.:
C21H17BrN2O5
Mol. Mass.:
457.274
SMILES:
OC(=O)[C@H]1NCCN([C@H]1C(O)=O)C(=O)c1ccc2c(ccc3cc(Br)ccc23)c1
: