Target
Tyrosyl-DNA phosphodiesterase 2
Ligand
BDBM50438865
Substrate
Meas. Tech.
ChEMBL_2202930 (CHEMBL5115638)
IC50
2600±n/a nM
Citation
 Zhang, YYang, HWang, FTPeng, XLiu, HYLi, QJAn, LK Discovery, enantioselective synthesis of myrtucommulone E analogues as tyrosyl-DNA phosphodiesterase 2 inhibitors and their biological activities. Eur J Med Chem 238:0 (2022) Target
Name:
Tyrosyl-DNA phosphodiesterase 2
Synonyms:
EAP2 ETS1-associated protein 2 TDP2 TTRAP Tyr-DNA phosphodiesterase 2 Tyrosyl-DNA phosphodiesterase 2 (hTDP2) VPg unlinkase | hTDP2
Type:
Enzyme Catalytic Domain
Mol. Mass.:
40916.54
Organism:
Homo sapiens (Human)
Description:
gi_23510348
Residue:
362
  
Inhibitor
Name:
BDBM50438865
Synonyms:
2,4-Dioxo-10-phenyl-pyrimido[4,5-b]quinoline-8-carbonitrile (3) | CHEMBL2420506
Type:
Small organic molecule
Emp. Form.:
C18H10N4O2
Mol. Mass.:
314.2976
SMILES:
O=c1nc2n(-c3ccccc3)c3cc(ccc3cc2c(=O)[nH]1)C#N
: