Target
Phosphatidylinositol 4,5-bisphosphate 3-kinase catalytic subunit beta isoform
Ligand
BDBM50592418
Substrate
Meas. Tech.
ChEMBL_2204104 (CHEMBL5116812)
IC50
2435±n/a nM
Citation
 Mohammed, EURPorter, ZJJennings, IGAl-Rawi, JMAThompson, PEAngove, MJ Synthesis and biological evaluation of 4H-benzo[e][1,3]oxazin-4-ones analogues of TGX-221 as inhibitors of PI3K?. Bioorg Med Chem 69:0 (2022) Target
Name:
Phosphatidylinositol 4,5-bisphosphate 3-kinase catalytic subunit beta isoform
Synonyms:
PI3-kinase p110 subunit beta PI3Kbeta PIK3CB Phosphatidylinositol 4,5-bisphosphate 3-kinase catalytic subunit beta (PI3Kbeta) Phosphatidylinositol 4,5-bisphosphate 3-kinase catalytic subunit beta isoform (PI3K) Phosphatidylinositol 4,5-bisphosphate 3-kinase catalytic subunit beta isoform (PI3Kbeta) Phosphatidylinositol-4,5-bisphosphate 3-kinase catalytic subunit beta isoform Phosphoinositide 3-Kinase (PI3K), beta Chain A PtdIns-3-kinase p110
Type:
Enzyme Subunit
Mol. Mass.:
122769.00
Organism:
Homo sapiens (Human)
Description:
P42338
Residue:
1070
  
Inhibitor
Name:
BDBM50592418
Synonyms:
CHEMBL5188598
Type:
Small organic molecule
Emp. Form.:
C22H24N2O4
Mol. Mass.:
380.437
SMILES:
CC(Oc1cccc(C)c1)c1cc(C)cc2c1oc(nc2=O)N1CCOCC1
: