Target
Cytochrome P450 2C9
Ligand
BDBM50027886
Substrate
Meas. Tech.
ChEMBL_2204936 (CHEMBL5117644)
IC50
404±n/a nM
Citation
 Zhao, LMWang, SPannecouque, CDe Clercq, EPiao, HRChen, FE Discovery of novel biphenyl-substituted pyridone derivatives as potent non-nucleoside reverse transcriptase inhibitors with promising oral bioavailability. Eur J Med Chem 240:0 (2022) Target
Name:
Cytochrome P450 2C9
Synonyms:
(R)-limonene 6-monooxygenase CP2C9_HUMAN CYP2C9 Cytochrome P450 2C9 (CYP2C9 ) P-450MP P450 PB-1 | S-mephenytoin 4-hydroxylase
Type:
Enzyme
Mol. Mass.:
55636.33
Organism:
Homo sapiens (Human)
Description:
P11712
Residue:
490
  
Inhibitor
Name:
BDBM50027886
Synonyms:
1-Butyl-3-(p-methylphenylsulfonyl)urea 1-Butyl-3-tosylurea N-(4-Methylphenylsulfonyl)-N'-butylurea N-Butyl-N'-(p-tolylsulfonyl)urea N-n-Butyl-N'-tosylurea TOLBUTAMIDE
Type:
Small organic molecule
Emp. Form.:
C12H18N2O3S
Mol. Mass.:
270.348
SMILES:
CCCCNC(=O)NS(=O)(=O)c1ccc(C)cc1
: