Target
Matrix metalloproteinase-14
Ligand
BDBM50592894
Substrate
Meas. Tech.
ChEMBL_2206244 (CHEMBL5118952)
IC50
0.330000±n/a nM
Citation
 Baidya, SKBanerjee, SAdhikari, NJha, T Selective Inhibitors of Medium-Size S1' Pocket Matrix Metalloproteinases: A Stepping Stone of Future Drug Discovery. J Med Chem 65:10709-10754 (2022) Target
Name:
Matrix metalloproteinase-14
Synonyms:
MMP-14 MMP14 MT-MMP 1 MT1MMP Matrix Metalloproteinase-14 (MMP-14) Matrix metalloproteinase-14 Membrane-type matrix metalloproteinase 1 | Membrane-type-1 matrix metalloproteinase
Type:
Protein
Mol. Mass.:
65900.19
Organism:
Homo sapiens (Human)
Description:
P50281
Residue:
582
  
Inhibitor
Name:
BDBM50592894
Synonyms:
CHEMBL473539
Type:
Small organic molecule
Emp. Form.:
C19H22N2O5S2
Mol. Mass.:
422.518
SMILES:
CC1(C)SCCN([C@H]1C(=O)NO)S(=O)(=O)c1ccc(Oc2ccccc2)cc1
: