Target
Heat shock protein HSP 90-alpha
Ligand
BDBM50354813
Substrate
Meas. Tech.
ChEMBL_2208386 (CHEMBL5121335)
Kd
3.4±n/a nM
Citation
 Das, BBaidya, ATKMathew, ATYadav, AKKumar, R Structural modification aimed for improving solubility of lead compounds in early phase drug discovery. Bioorg Med Chem 56:0 (2022) Target
Name:
Heat shock protein HSP 90-alpha
Synonyms:
HS90A_HUMAN HSP86 HSP90AA1 HSPCA Heat shock 86 kDa Heat shock protein HSP 90-alpha (HSP90) LAP-2 Lipopolysaccharide-associated protein 2 heat shock protein 90kDa alpha (cytosolic), class A member 1 isoform 2
Type:
Molecular Chaperone
Mol. Mass.:
84623.45
Organism:
Homo sapiens (Human)
Description:
P07900
Residue:
732
  
Inhibitor
Name:
BDBM50354813
Synonyms:
CHEMBL1834096
Type:
Small organic molecule
Emp. Form.:
C16H13ClN4OS
Mol. Mass.:
344.819
SMILES:
CSc1nc(N)nc(n1)-c1c(Cl)cc2COCc3cccc1c23
: