Target
Poly [ADP-ribose] polymerase tankyrase-2
Ligand
BDBM50188594
Substrate
Meas. Tech.
ChEMBL_2209288 (CHEMBL5122237)
IC50
4.0±n/a nM
Citation
 Yu, MYang, YSykes, MWang, S Small-Molecule Inhibitors of Tankyrases as Prospective Therapeutics for Cancer. J Med Chem 65:5244-5273 (2022) Target
Name:
Poly [ADP-ribose] polymerase tankyrase-2
Synonyms:
(ARTD6 or PARP5b) Poly [ADP-ribose] polymerase tankyrase-2 TNKL TNKS2_HUMAN Tankyrase 2 Tankyrase-2 Tankyrase-2 (TNKS2)
Type:
Enzyme
Mol. Mass.:
126937.16
Organism:
Homo sapiens (Human)
Description:
Q9H2K2
Residue:
1166
  
Inhibitor
Name:
BDBM50188594
Synonyms:
CHEBI:62878 | CHEMBL1086580
Type:
Small organic molecule
Emp. Form.:
C14H11F3N2OS
Mol. Mass.:
312.31
SMILES:
Oc1nc(nc2CCSCc12)-c1ccc(cc1)C(F)(F)F
: