Target
Metabotropic glutamate receptor 2
Ligand
BDBM50167033
Substrate
Meas. Tech.
ChEMBL_312277 (CHEMBL836552)
IC50
1750±n/a nM
Citation
 Dominguez, CPrieto, LValli, MJMassey, SMBures, MWright, RAJohnson, BGAndis, SLKingston, ASchoepp, DDMonn, JA Methyl substitution of 2-aminobicyclo[3.1.0]hexane 2,6-dicarboxylate (LY354740) determines functional activity at metabotropic glutamate receptors: identification of a subtype selective mGlu2 receptor agonist. J Med Chem 48:3605-12 (2005)  
Target
Name:
Metabotropic glutamate receptor 2
Synonyms:
GPRC1B GRM2_HUMAN Metabotropic glutamate receptor mGlu2 | metabotropic glutamate 2
Type:
Enzyme
Mol. Mass.:
95584.88
Organism:
Homo sapiens (Human)
Description:
Q14416
Residue:
872
  
Inhibitor
Name:
BDBM50167033
Synonyms:
(1S,2S,3R,5R,6S)-2-Amino-3-methyl-bicyclo[3.1.0]hexane-2,6-dicarboxylic acid | CHEMBL192977
Type:
Small organic molecule
Emp. Form.:
C9H13NO4
Mol. Mass.:
199.2038
SMILES:
C[C@@H]1C[C@H]2[C@@H]([C@H]2[C@]1(N)C(O)=O)C(O)=O
: