Target
Metabotropic glutamate receptor 3
Ligand
BDBM50167032
Substrate
Meas. Tech.
ChEMBL_303521 (CHEMBL839635)
Ki
570±n/a nM
Citation
 Dominguez, CPrieto, LValli, MJMassey, SMBures, MWright, RAJohnson, BGAndis, SLKingston, ASchoepp, DDMonn, JA Methyl substitution of 2-aminobicyclo[3.1.0]hexane 2,6-dicarboxylate (LY354740) determines functional activity at metabotropic glutamate receptors: identification of a subtype selective mGlu2 receptor agonist. J Med Chem 48:3605-12 (2005)  
Target
Name:
Metabotropic glutamate receptor 3
Synonyms:
GPRC1C GRM3_HUMAN metabotropic glutamate 3 metabotropic glutamate 3/1c
Type:
Enzyme Catalytic Domain
Mol. Mass.:
98889.09
Organism:
Homo sapiens (Human)
Description:
metabotropic glutamate 1c 0 HUMAN::Q14832
Residue:
879
  
Inhibitor
Name:
BDBM50167032
Synonyms:
(1S,2S,4R,5R,6S)-2-Amino-4-methyl-bicyclo[3.1.0]hexane-2,6-dicarboxylic acid | CHEMBL192051
Type:
Small organic molecule
Emp. Form.:
C9H13NO4
Mol. Mass.:
199.2038
SMILES:
C[C@@H]1C[C@](N)([C@H]2[C@@H]1[C@@H]2C(O)=O)C(O)=O
: