Target
Protein mono-ADP-ribosyltransferase PARP10
Ligand
BDBM50594005
Substrate
Meas. Tech.
ChEMBL_2210611 (CHEMBL5123560)
IC50
140±n/a nM
Citation
 Nizi, MGMaksimainen, MMMurthy, SMassari, SAlaviuhkola, JLippok, BESowa, STGalera-Prat, APrunskaite-Hyyryläinen, RLüscher, BKorn, PLehtiö, LTabarrini, O Potent 2,3-dihydrophthalazine-1,4-dione derivatives as dual inhibitors for mono-ADP-ribosyltransferases PARP10 and PARP15. Eur J Med Chem 237:0 (2022) Target
Name:
Protein mono-ADP-ribosyltransferase PARP10
Synonyms:
2.4.2.- ADP-ribosyltransferase diphtheria toxin-like 10 Human diphtheria toxin-like ADP-ribosyltransferase (ARTD10 or PARP10, L926Y)) Human diphtheria toxin-like ADP-ribosyltransferase (ARTD10 or PARP10, S927A)) PARP-10 Poly [ADP-ribose] polymerase 10
Type:
Mol. Mass.:
109953.63
Organism:
Homo sapiens (Human)
Description:
Q53GL7
Residue:
1025
  
Inhibitor
Name:
BDBM50594005
Synonyms:
CHEMBL5181947
Type:
Small organic molecule
Emp. Form.:
C15H18N2O3
Mol. Mass.:
274.315
SMILES:
O=c1[nH][nH]c(=O)c2cc(OCC3CCCCC3)ccc12
: