Target
Poly [ADP-ribose] polymerase tankyrase-1
Ligand
BDBM50188594
Substrate
Meas. Tech.
ChEMBL_2210699 (CHEMBL5123648)
IC50
1.9±n/a nM
Citation
 Xu, YWu, HHuang, LZhai, BLi, XXu, SWu, XZhu, QXu, Q Rational design, synthesis and biological evaluation of dual PARP-1/2 and TNKS1/2 inhibitors for cancer therapy. Eur J Med Chem 237:0 (2022) Target
Name:
Poly [ADP-ribose] polymerase tankyrase-1
Synonyms:
(ARTD5 or PARP5a) PARPL Poly [ADP-ribose] polymerase tankyrase-1 TINF1 TNKS1 Tankyrase 1 Tankyrase-1 Tankyrase-1 (TNKS1)
Type:
Enzyme
Mol. Mass.:
142058.03
Organism:
Homo sapiens (Human)
Description:
O95271
Residue:
1327
  
Inhibitor
Name:
BDBM50188594
Synonyms:
CHEBI:62878 | CHEMBL1086580
Type:
Small organic molecule
Emp. Form.:
C14H11F3N2OS
Mol. Mass.:
312.31
SMILES:
Oc1nc(nc2CCSCc12)-c1ccc(cc1)C(F)(F)F
: