Target
Type-2 angiotensin II receptor
Ligand
BDBM50594186
Substrate
Meas. Tech.
ChEMBL_2211258 (CHEMBL5124207)
Ki
1.4±n/a nM
Citation
 Gopalan, GPalo-Nieto, CPetersen, NNHallberg, MLarhed, M Angiotensin II AT2 receptor ligands with phenylthiazole scaffolds. Bioorg Med Chem 65:0 (2022) Target
Name:
Type-2 angiotensin II receptor
Synonyms:
AGTR2 AT2 Angiotensin II type 2 (AT-2) receptor Type-2 angiotensin II receptor
Type:
Enzyme Catalytic Domain
Mol. Mass.:
41201.61
Organism:
Homo sapiens (Human)
Description:
Angiotensin II, central 0 0::P50052
Residue:
363
  
Inhibitor
Name:
BDBM50594186
Synonyms:
CHEMBL5174659
Type:
Small organic molecule
Emp. Form.:
C21H21N5O4S3
Mol. Mass.:
503.618
SMILES:
CCCc1nc(c(s1)S(=O)(=O)NC(=O)OC)-c1ccc(Cn2ccnc2-c2nccs2)cc1
: