Target
Bromodomain-containing protein 4
Ligand
BDBM50594438
Substrate
Meas. Tech.
ChEMBL_2212961 (CHEMBL5125910)
Kd
4.0±n/a nM
Citation
 Guan, XCheryala, NKarim, RMChan, ABerndt, NQi, JGeorg, GISchönbrunn, E Bivalent BET Bromodomain Inhibitors Confer Increased Potency and Selectivity for BRDT via Protein Conformational Plasticity. J Med Chem 65:10441-10458 (2022) Target
Name:
Bromodomain-containing protein 4
Synonyms:
BRD4 Bromodomain-containing protein 4 (BRD4) Protein HUNK1
Type:
Protein
Mol. Mass.:
152264.84
Organism:
Homo sapiens (Human)
Description:
O60885
Residue:
1362
  
Inhibitor
Name:
BDBM50594438
Synonyms:
CHEMBL5201173
Type:
Small organic molecule
Emp. Form.:
C60H72Cl2F2N14O10S2
Mol. Mass.:
1322.334
SMILES:
Cc1cnc(Nc2ccc(C(=O)NC3CCN(CC3)C(=O)COCCOCC(=O)N3CCC(CC3)NC(=O)c3ccc(Nc4ncc(C)c(Nc5ccc(Cl)c(NS(=O)(=O)C(C)(C)C)c5)n4)cc3F)c(F)c2)nc1Nc1ccc(Cl)c(NS(=O)(=O)C(C)(C)C)c1
: