Target
Bromodomain-containing protein 4
Ligand
BDBM50594435
Substrate
Meas. Tech.
ChEMBL_2212962 (CHEMBL5125911)
Kd
3.7±n/a nM
Citation
 Guan, XCheryala, NKarim, RMChan, ABerndt, NQi, JGeorg, GISchönbrunn, E Bivalent BET Bromodomain Inhibitors Confer Increased Potency and Selectivity for BRDT via Protein Conformational Plasticity. J Med Chem 65:10441-10458 (2022) Target
Name:
Bromodomain-containing protein 4
Synonyms:
BRD4 Bromodomain-containing protein 4 (BRD4) Protein HUNK1
Type:
Protein
Mol. Mass.:
152264.84
Organism:
Homo sapiens (Human)
Description:
O60885
Residue:
1362
  
Inhibitor
Name:
BDBM50594435
Synonyms:
CHEMBL5184876
Type:
Small organic molecule
Emp. Form.:
C24H21ClN2O4S
Mol. Mass.:
468.953
SMILES:
CCS(=O)(=O)Nc1ccc(Oc2ccc(Cl)cc2)c(c1)-c1cn(C)c(=O)c2ccccc12
: