Target
Cyclin-dependent kinase 12
Ligand
BDBM50594507
Substrate
Meas. Tech.
ChEMBL_2213165 (CHEMBL5126114)
Kd
27±n/a nM
Citation
 Yang, JChang, YTien, JCWang, ZZhou, YZhang, PHuang, WVo, JApel, IJWang, CZeng, VZCheng, YLi, SWang, GXChinnaiyan, AMDing, K Discovery of a Highly Potent and Selective Dual PROTAC Degrader of CDK12 and CDK13. J Med Chem 65:11066-11083 (2022) Target
Name:
Cyclin-dependent kinase 12
Synonyms:
2.7.11.22 CDC2-related protein kinase 7 CDK12_HUMAN CRKRS Cell division cycle 2-related protein kinase 7 Cyclin-dependent kinase 12 hCDK12
Type:
PROTEIN
Mol. Mass.:
164218.64
Organism:
Homo sapiens
Description:
ChEMBL_117739
Residue:
1490
  
Inhibitor
Name:
BDBM50594507
Synonyms:
CHEMBL5203891
Type:
Small organic molecule
Emp. Form.:
C30H35N7O
Mol. Mass.:
509.6452
SMILES:
O=C(NCc1ccccc1)N([C@H]1CC[C@@H](CC1)Nc1ccc(cn1)C#N)c1ccc(cc1)N1CCNCC1
: